Reaction Details
TargetC-C chemokine receptor type 5
LigandBDBM50105557
Substrate/Competitorn/a
Meas. Tech.ChEBML_39629
IC50 2±n/a nM
Citation Hale, JJBudhu, RJHolson, EBFinke, PEOates, BMills, SGMacCoss, MGould, SLDeMartino, JASpringer, MSSiciliano, SMalkowitz, LSchleif, WAHazuda, DMiller, MKessler, JDanzeisen, RHolmes, KLineberger, JCarella, ACarver, GEmini, E 1,3,4-Trisubstituted pyrrolidine CCR5 receptor antagonists. Part 2: lead optimization affording selective, orally bioavailable compounds with potent anti-HIV activity. Bioorg Med Chem Lett11:2741-5 (2001) C-C chemokine receptor type 5
Name:C-C chemokine receptor type 5
Type:Enzyme
Mol. Mass.:40540.21
Organism:Homo sapiens (Human)
Description:P51681
Residue:352
BDBM50105557
NameBDBM50105557
Synonyms:CHEMBL93851 | {1-[(3S,4S)-1-(2-Chloro-benzoyl)-4-phenyl-pyrrolidin-3-ylmethyl]-piperidin-4-yl}-ethyl-carbamic acid benzyl ester
TypeSmall organic molecule
Emp. Form.C33H38ClN3O3
Mol. Mass.560.126
SMILESCCN(C1CCN(C[C@H]2CN(C[C@@H]2c2ccccc2)C(=O)c2ccccc2Cl)CC1)C(=O)OCc1ccccc1