Reaction Details
TargetThyroid hormone receptor beta
LigandBDBM50105671
Substrate/Competitorn/a
Meas. Tech.ChEBML_210495
Kd 4200±n/a nM
Citation Yoshihara, HAApriletti, JWBaxter, JDScanlan, TS A designed antagonist of the thyroid hormone receptor. Bioorg Med Chem Lett11:2821-5 (2001) Thyroid hormone receptor beta
Name:Thyroid hormone receptor beta
Type:Receptor
Mol. Mass.:52793.62
Organism:Homo sapiens (Human)
Description:Recombinant hThR was obtained from nuclear extracts from SF9 cells infected with baculovirus vectors encoding for ThRbeta 1.
Residue:461
BDBM50105671
NameBDBM50105671
Synonyms:CHEMBL97187 | {4-[(2,4-Dimethoxy-phenyl)-(4-hydroxy-3-isopropyl-phenyl)-methyl]-3,5-dimethyl-phenoxy}-acetic acid
TypeSmall organic molecule
Emp. Form.C28H32O6
Mol. Mass.464.5501
SMILESCOc1ccc(C(c2ccc(O)c(c2)C(C)C)c2c(C)cc(OCC(O)=O)cc2C)c(OC)c1