Reaction Details
TargetHistone deacetylase 1
LigandBDBM50105696
Substrate/Competitorn/a
Meas. Tech.ChEMBL_205835 (CHEMBL810946)
EC50 5000±n/a nM
Citation Lavoie, RBouchain, GFrechette, SWoo, SHAbou-Khalil, ELeit, SFournel, MYan, PTTrachy-Bourget, MCBeaulieu, CLi, ZBesterman, JDelorme, D Design and synthesis of a novel class of histone deacetylase inhibitors. Bioorg Med Chem Lett11:2847-50 (2001) Histone deacetylase 1
Name:Histone deacetylase 1
Type:Enzyme
Mol. Mass.:55090.27
Organism:Homo sapiens (Human)
Description:Q13547
Residue:482
BDBM50105696
NameBDBM50105696
Synonyms:(E)-3-[4-(3,4-Dichloro-benzenesulfonylamino)-phenyl]-N-hydroxy-acrylamide CHEMBL95850 | US8796330, 109
TypeSmall organic molecule
Emp. Form.C15H12Cl2N2O4S
Mol. Mass.387.238
SMILESONC(=O)\C=C\c1ccc(NS(=O)(=O)c2ccc(Cl)c(Cl)c2)cc1