Reaction Details
TargetHistone deacetylase 1
LigandBDBM50105685
Substrate/Competitorn/a
Meas. Tech.ChEMBL_205835 (CHEMBL810946)
EC50>25000±n/a nM
Citation Lavoie, RBouchain, GFrechette, SWoo, SHAbou-Khalil, ELeit, SFournel, MYan, PTTrachy-Bourget, MCBeaulieu, CLi, ZBesterman, JDelorme, D Design and synthesis of a novel class of histone deacetylase inhibitors. Bioorg Med Chem Lett11:2847-50 (2001) Histone deacetylase 1
Name:Histone deacetylase 1
Type:Enzyme
Mol. Mass.:55090.27
Organism:Homo sapiens (Human)
Description:Q13547
Residue:482
BDBM50105685
NameBDBM50105685
Synonyms:(E)-3-[4-(Benzenesulfonyl-methyl-amino)-phenyl]-N-hydroxy-acrylamide CHEMBL97387 US8796330, 170
TypeSmall organic molecule
Emp. Form.C16H16N2O4S
Mol. Mass.332.374
SMILESCN(c1ccc(\C=C\C(=O)NO)cc1)S(=O)(=O)c1ccccc1