Reaction Details
TargetHistone deacetylase 1
LigandBDBM50105690
Substrate/Competitorn/a
Meas. Tech.ChEMBL_205835 (CHEMBL810946)
EC50>25000±n/a nM
Citation Lavoie, RBouchain, GFrechette, SWoo, SHAbou-Khalil, ELeit, SFournel, MYan, PTTrachy-Bourget, MCBeaulieu, CLi, ZBesterman, JDelorme, D Design and synthesis of a novel class of histone deacetylase inhibitors. Bioorg Med Chem Lett11:2847-50 (2001) Histone deacetylase 1
Name:Histone deacetylase 1
Type:Enzyme
Mol. Mass.:55090.27
Organism:Homo sapiens (Human)
Description:Q13547
Residue:482
BDBM50105690
NameBDBM50105690
Synonyms:2-(4-Benzenesulfonylamino-phenyl)-N-hydroxy-acetamide N-hydroxy-2-(4-(phenylsulfonamido)phenyl)acetamide
TypeSmall organic molecule
Emp. Form.C14H14N2O4S
Mol. Mass.306.337
SMILESONC(=O)Cc1ccc(NS(=O)(=O)c2ccccc2)cc1