Reaction Details
TargetDual specificity mitogen-activated protein kinase kinase 2
LigandBDBM50105742
Substrate/Competitorn/a
Meas. Tech.ChEBML_65273
IC50>50±n/a nM
Citation Adams, JLBoehm, JCGallagher, TFKassis, SWebb, EFHall, RSorenson, MGarigipati, RGriswold, DELee, JC Pyrimidinylimidazole inhibitors of p38: cyclic N-1 imidazole substituents enhance p38 kinase inhibition and oral activity. Bioorg Med Chem Lett11:2867-70 (2001) Dual specificity mitogen-activated protein kinase kinase 2
Name:Dual specificity mitogen-activated protein kinase kinase 2
Type:Enzyme Catalytic Domain
Mol. Mass.:44423.61
Organism:Homo sapiens (Human)
Description:gi_13489054
Residue:400
BDBM50105742
NameBDBM50105742
Synonyms:4-[4-(4-Fluoro-phenyl)-5-(2-methoxy-pyrimidin-4-yl)-imidazol-1-yl]-cyclohexanol trans -1-(4-hydroxycyclohexyl)-4-(4-fluorophenyl)-5-(2-methoxypyrimidin-4-yl)imidazole
TypeSmall organic molecule
Emp. Form.C20H21FN4O2
Mol. Mass.368.4047
SMILESCOc1nccc(n1)-c1c(ncn1[C@H]1CC[C@H](O)CC1)-c1ccc(F)cc1