Reaction Details
TargetCytochrome P450 2C18
LigandBDBM50105815
Substrate/Competitorn/a
Meas. Tech.ChEMBL_51520 (CHEMBL660380)
IC50 18000±n/a nM
Citation Ha-Duong, NTDijols, SMarques-Soares, CMinoletti, CDansette, PMMansuy, D Synthesis of sulfaphenazole derivatives and their use as inhibitors and tools for comparing the active sites of human liver cytochromes P450 of the 2C subfamily. J Med Chem44:3622-31 (2001) Cytochrome P450 2C18
Name:Cytochrome P450 2C18
Type:PROTEIN
Mol. Mass.:55714.53
Organism:Homo sapiens (Human)
Description:ChEMBL_51520
Residue:490
BDBM50105815
NameBDBM50105815
Synonyms:4-Allyl-N-(3-hydroxy-propyl)-N-(2-phenyl-2H-pyrazol-3-yl)-benzenesulfonamide | CHEMBL333210
TypeSmall organic molecule
Emp. Form.C21H23N3O3S
Mol. Mass.397.491
SMILESOCCCN(c1ccnn1-c1ccccc1)S(=O)(=O)c1ccc(CC=C)cc1