Reaction Details
TargetCytochrome P450 2C9
LigandBDBM50090669
Substrate/Competitorn/a
Meas. Tech.ChEMBL_44697 (CHEMBL659091)
IC50 600±n/a nM
Citation Ha-Duong, NTDijols, SMarques-Soares, CMinoletti, CDansette, PMMansuy, D Synthesis of sulfaphenazole derivatives and their use as inhibitors and tools for comparing the active sites of human liver cytochromes P450 of the 2C subfamily. J Med Chem44:3622-31 (2001) Cytochrome P450 2C9
Name:Cytochrome P450 2C9
Type:Enzyme
Mol. Mass.:55636.33
Organism:Homo sapiens (Human)
Description:P11712
Residue:490
BDBM50090669
NameBDBM50090669
Synonyms:4-Methyl-N-(2-phenyl-2H-pyrazol-3-yl)-benzenesulfonamide | CHEMBL432386
TypeSmall organic molecule
Emp. Form.C16H15N3O2S
Mol. Mass.313.374
SMILESCc1ccc(cc1)S(=O)(=O)Nc1ccnn1-c1ccccc1