Reaction Details
TargetCytochrome P450 2C18
LigandBDBM50105816
Substrate/Competitorn/a
Meas. Tech.ChEMBL_51520 (CHEMBL660380)
IC50 8000±n/a nM
Citation Ha-Duong, NTDijols, SMarques-Soares, CMinoletti, CDansette, PMMansuy, D Synthesis of sulfaphenazole derivatives and their use as inhibitors and tools for comparing the active sites of human liver cytochromes P450 of the 2C subfamily. J Med Chem44:3622-31 (2001) Cytochrome P450 2C18
Name:Cytochrome P450 2C18
Type:PROTEIN
Mol. Mass.:55714.53
Organism:Homo sapiens (Human)
Description:ChEMBL_51520
Residue:490
BDBM50105816
NameBDBM50105816
Synonyms:4-Amino-N-(2-phenyl-2H-pyrazol-3-yl)-N-propyl-benzenesulfonamide | CHEMBL120183
TypeSmall organic molecule
Emp. Form.C18H20N4O2S
Mol. Mass.356.442
SMILESCCCN(c1ccnn1-c1ccccc1)S(=O)(=O)c1ccc(N)cc1