Reaction Details
TargetMelanocortin receptor 5
LigandBDBM50105887
Substrate/Competitorn/a
Meas. Tech.ChEMBL_220876 (CHEMBL824632)
Ki 16±n/a nM
Citation Bednarek, MAMacNeil, TKalyani, RNTang, RVan der Ploeg, LHWeinberg, DH Selective, high affinity peptide antagonists of alpha-melanotropin action at human melanocortin receptor 4: their synthesis and biological evaluation in vitro. J Med Chem44:3665-72 (2001) Melanocortin receptor 5
Name:Melanocortin receptor 5
Type:Enzyme
Mol. Mass.:36612.92
Organism:Homo sapiens (Human)
Description:P33032
Residue:325
BDBM50105887
NameBDBM50105887
Synonyms:CHEMBL2370553 | Cyclo Ac-Cys-Glu-His-D-(2')Nal-Arg-Trp-Gly-Cys-Pro-Pro-Lys-Asp-NH2
TypeSmall organic molecule
Emp. Form.C70H93N19O16S2
Mol. Mass.1520.735
SMILESCC(=O)N[C@@H]1CSSC[C@H](NC(=O)CNC(=O)[C@@H](Cc2c[nH]c3ccccc23)NC(=O)[C@H](CCCN=C(N)N)NC(=O)[C@H](Cc2ccc3ccccc3c2)NC(=O)[C@H](Cc2c[nH]cn2)NC(=O)[C@@H](CCC(O)=O)NC1=O)C(=O)N1CCC[C@H]1C(=O)N1CCC[C@H]1C(=O)[C@H](CCCCN)NC(=O)[C@@H](N)CC(O)=O