Reaction Details
TargetMelanocortin receptor 5
LigandBDBM50105891
Substrate/Competitorn/a
Meas. Tech.ChEMBL_220876 (CHEMBL824632)
Ki 140±n/a nM
Citation Bednarek, MAMacNeil, TKalyani, RNTang, RVan der Ploeg, LHWeinberg, DH Selective, high affinity peptide antagonists of alpha-melanotropin action at human melanocortin receptor 4: their synthesis and biological evaluation in vitro. J Med Chem44:3665-72 (2001) Melanocortin receptor 5
Name:Melanocortin receptor 5
Type:Enzyme
Mol. Mass.:36612.92
Organism:Homo sapiens (Human)
Description:P33032
Residue:325
BDBM50105891
NameBDBM50105891
Synonyms:13-Ethyl-6-(3-guanidino-propyl)-3-(1H-indol-3-ylmethyl)-9-naphthalen-2-ylmethyl-2,5,8,11,14-pentaoxo-1,4,7,10,15pentaaza-cycloicosane-20-carboxylic acid amide | CHEMBL122773
TypeSmall organic molecule
Emp. Form.C42H54N10O6
Mol. Mass.794.9416
SMILESCCC1CC(=O)N[C@@H](Cc2ccc3ccccc3c2)C(=O)N[C@@H](CCCNC(N)=N)C(=O)N[C@H](Cc2c[nH]c3ccccc23)C(=O)N[C@H](CCCCNC1=O)C(N)=O