Reaction Details
TargetMelanocortin receptor 4
LigandBDBM50105888
Substrate/Competitorn/a
Meas. Tech.ChEMBL_220873 (CHEMBL824629)
Ki 0.500000±n/a nM
Citation Bednarek, MAMacNeil, TKalyani, RNTang, RVan der Ploeg, LHWeinberg, DH Selective, high affinity peptide antagonists of alpha-melanotropin action at human melanocortin receptor 4: their synthesis and biological evaluation in vitro. J Med Chem44:3665-72 (2001) Melanocortin receptor 4
Name:Melanocortin receptor 4
Type:Enzyme
Mol. Mass.:36949.50
Organism:Homo sapiens (Human)
Description:P32245
Residue:332
BDBM50105888
NameBDBM50105888
Synonyms:6-(3-Guanidino-propyl)-3-(1H-indol-3-ylmethyl)-9-naphthalen-2-ylmethyl-2,5,8,11,14-pentaoxo-1,4,7,10,15pentaaza-cycloicosane-20-carboxylic acid | CHEMBL123938
TypeSmall organic molecule
Emp. Form.C40H51N11O6
Mol. Mass.781.903
SMILESNNC(=O)[C@H]1CCCCNC(=O)CCC(=O)N[C@@H](Cc2ccc3ccccc3c2)C(=O)N[C@@H](CCCNC(N)=N)C(=O)N[C@H](Cc2c[nH]c3ccccc23)C(=O)N1