Reaction Details
Target72 kDa type IV collagenase
LigandBDBM50106022
Substrate/Competitorn/a
Meas. Tech.ChEBML_104557
IC50 0.260000±n/a nM
Citation Holms, JMast, KMarcotte, PElmore, ILi, JPease, LGlaser, KMorgan, DMichaelides, MDavidsen, S Discovery of selective hydroxamic acid inhibitors of tumor necrosis factor-alpha converting enzyme. Bioorg Med Chem Lett11:2907-10 (2001) 72 kDa type IV collagenase
Name:72 kDa type IV collagenase
Type:Enzyme
Mol. Mass.:73870.36
Organism:Homo sapiens (Human)
Description: P08253
Residue:660
BDBM50106022
NameBDBM50106022
Synonyms:(7S,8R,11S)-8-[3-(4-chloro-phenyl)-propyl]-9-oxo-2-oxa-10-aza-bicyclo[11.2.2]heptadeca-1(16),13(17),14-triene-7,11-dicarboxylic acid 7-hydroxyamide 11-methylamide | CHEMBL318860
TypeSmall organic molecule
Emp. Form.C27H34ClN3O5
Mol. Mass.516.029
SMILESCNC(=O)[C@@H]1Cc2ccc(OCCCC[C@@H]([C@@H](CCCc3ccc(Cl)cc3)C(=O)N1)C(=O)NO)cc2