Reaction Details
TargetPeroxisome proliferator-activated receptor gamma
LigandBDBM50106109
Substrate/Competitorn/a
Meas. Tech.ChEBML_154052
EC50 0.500000±n/a nM
Citation Liu, KGLambert, MHLeesnitzer, LMOliver, WOtt, RJPlunket, KDStuart, LWBrown, PJWillson, TMSternbach, DD Identification of a series of PPAR gamma/delta dual agonists via solid-phase parallel synthesis. Bioorg Med Chem Lett11:2959-62 (2001) Peroxisome proliferator-activated receptor gamma
Name:Peroxisome proliferator-activated receptor gamma
Type:Nuclear Receptor
Mol. Mass.:57613.46
Organism:Homo sapiens (Human)
Description:P37231
Residue:505
BDBM50106109
NameBDBM50106109
Synonyms:4-Isocyanato-benzoic acid 2-((2,4-bis-trifluoromethyl-benzyl)-{3-[3-(1-carboxy-1-methyl-ethoxy)-phenyl]-propyl}-amino)-ethyl ester | CHEMBL318696
TypeSmall organic molecule
Emp. Form.C32H30F6N2O6
Mol. Mass.652.5808
SMILESCC(C)(Oc1cccc(CCCN(CCOC(=O)c2ccc(cc2)N=C=O)Cc2ccc(cc2C(F)(F)F)C(F)(F)F)c1)C(O)=O