Reaction Details
TargetPotassium voltage-gated channel subfamily KQT member 1
LigandBDBM50106164
Substrate/Competitorn/a
Meas. Tech.ChEMBL_158397 (CHEMBL767061)
IC50 580±n/a nM
Citation Lloyd, JSchmidt, JBRovnyak, GAhmad, SAtwal, KSBisaha, SNDoweyko, LMStein, PDTraeger, SCMathur, AConder, MLDiMarco, JHarper, TWJenkins-West, TLevesque, PCNormandin, DERussell, ADSerafino, RPSmith, MALodge, NJ Design and synthesis of 4-substituted benzamides as potent, selective, and orally bioavailable I(Ks) blockers. J Med Chem44:3764-7 (2001) Potassium voltage-gated channel subfamily KQT member 1
Name:Potassium voltage-gated channel subfamily KQT member 1
Type:PROTEIN
Mol. Mass.:74450.11
Organism:Cavia porcellus
Description:ChEMBL_88894
Residue:671
BDBM50106164
NameBDBM50106164
Synonyms:CHEMBL123569 | Enantiomer-N-(2,2-Dimethyl-cyclopentylmethyl)-4-(3-methyl-[1,2,4]oxadiazol-5-yl)-benzamide
TypeSmall organic molecule
Emp. Form.C18H23N3O2
Mol. Mass.313.3941
SMILESCc1noc(n1)-c1ccc(cc1)C(=O)NCC1CCCC1(C)C