Reaction Details
TargetPotassium voltage-gated channel subfamily KQT member 1
LigandBDBM50106172
Substrate/Competitorn/a
Meas. Tech.ChEMBL_158397 (CHEMBL767061)
IC50>30000±n/a nM
Citation Lloyd, JSchmidt, JBRovnyak, GAhmad, SAtwal, KSBisaha, SNDoweyko, LMStein, PDTraeger, SCMathur, AConder, MLDiMarco, JHarper, TWJenkins-West, TLevesque, PCNormandin, DERussell, ADSerafino, RPSmith, MALodge, NJ Design and synthesis of 4-substituted benzamides as potent, selective, and orally bioavailable I(Ks) blockers. J Med Chem44:3764-7 (2001) Potassium voltage-gated channel subfamily KQT member 1
Name:Potassium voltage-gated channel subfamily KQT member 1
Type:PROTEIN
Mol. Mass.:74450.11
Organism:Cavia porcellus
Description:ChEMBL_88894
Residue:671
BDBM50106172
NameBDBM50106172
Synonyms:CHEMBL340222 | N-(2,2-Dimethyl-cyclopentyl)-4-hexyloxy-benzamide
TypeSmall organic molecule
Emp. Form.C20H31NO2
Mol. Mass.317.4656
SMILESCCCCCCOc1ccc(cc1)C(=O)NC1CCCC1(C)C