Reaction Details
TargetPotassium voltage-gated channel subfamily E/KQT member 1
LigandBDBM50106226
Substrate/Competitorn/a
Meas. Tech.ChEMBL_158552 (CHEMBL768695)
IC50 1100±n/a nM
Citation Gerlach, UBrendel, JLang, HJPaulus, EFWeidmann, KBrüggemann, ABusch, AESuessbrich, HBleich, MGreger, R Synthesis and activity of novel and selective I(Ks)-channel blockers. J Med Chem44:3831-7 (2001) Potassium voltage-gated channel subfamily E/KQT member 1
Name:Potassium voltage-gated channel subfamily E/KQT member 1
Type:n/a
Mol. Mass.:n/a
Description:ASSAY_ID of EBI is 158552
Components:This complex has 2 components.
Component 1
Name:Potassium voltage-gated channel subfamily E member 1
Synonyms:Delayed rectifier potassium channel subunit IsK KCNE1 KCNQ1(Kv7.1)/KCNE1(MinK) Voltage-gated potassium channel beta subunit Mink | Voltage-gated potassium channel, IKs
Type:PROTEIN
Mol. Mass.:14676.11
Organism:Homo sapiens (Human)
Description:ChEMBL_1456351
Residue:129
Component 2
Name:Potassium voltage-gated channel subfamily KQT member 1
Synonyms:KCNA8 KCNQ (Kv7) potassium channel KCNQ1_HUMAN Voltage-gated potassium channel subunit Kv7.1 | Voltage-gated potassium channel subunit Kv7.1/Misshapen-like kinase 1
Type:PROTEIN
Mol. Mass.:74739.00
Organism:Homo sapiens (Human)
Description:ChEMBL_1454245
Residue:676
BDBM50106226
NameBDBM50106226
Synonyms:CHEMBL338171 | N-(6-Chloro-3-hydroxy-2,2-dimethyl-chroman-4-yl)-N-methyl-methanesulfonamide
TypeSmall organic molecule
Emp. Form.C13H18ClNO4S
Mol. Mass.319.804
SMILESCN(C1C(O)C(C)(C)Oc2ccc(Cl)cc12)S(C)(=O)=O