Reaction Details
TargetPotassium voltage-gated channel subfamily E/KQT member 1
LigandBDBM50106236
Substrate/Competitorn/a
Meas. Tech.ChEMBL_158552 (CHEMBL768695)
IC50 50±n/a nM
Citation Gerlach, UBrendel, JLang, HJPaulus, EFWeidmann, KBrüggemann, ABusch, AESuessbrich, HBleich, MGreger, R Synthesis and activity of novel and selective I(Ks)-channel blockers. J Med Chem44:3831-7 (2001) Potassium voltage-gated channel subfamily E/KQT member 1
Name:Potassium voltage-gated channel subfamily E/KQT member 1
Type:n/a
Mol. Mass.:n/a
Description:ASSAY_ID of EBI is 158552
Components:This complex has 2 components.
Component 1
Name:Potassium voltage-gated channel subfamily E member 1
Synonyms:Delayed rectifier potassium channel subunit IsK KCNE1 KCNQ1(Kv7.1)/KCNE1(MinK) Voltage-gated potassium channel beta subunit Mink | Voltage-gated potassium channel, IKs
Type:PROTEIN
Mol. Mass.:14676.11
Organism:Homo sapiens (Human)
Description:ChEMBL_1456351
Residue:129
Component 2
Name:Potassium voltage-gated channel subfamily KQT member 1
Synonyms:KCNA8 KCNQ (Kv7) potassium channel KCNQ1_HUMAN Voltage-gated potassium channel subunit Kv7.1 | Voltage-gated potassium channel subunit Kv7.1/Misshapen-like kinase 1
Type:PROTEIN
Mol. Mass.:74739.00
Organism:Homo sapiens (Human)
Description:ChEMBL_1454245
Residue:676
BDBM50106236
NameBDBM50106236
Synonyms:(3R,4S)-Ethanesulfonic acid (6-benzyloxy-3-hydroxy-2,2-dimethyl-chroman-4-yl)-methyl-amide | CHEMBL124454
TypeSmall organic molecule
Emp. Form.C21H27NO5S
Mol. Mass.405.508
SMILESCCS(=O)(=O)N(C)[C@@H]1[C@@H](O)C(C)(C)Oc2ccc(OCc3ccccc3)cc12