Reaction Details
TargetUrokinase-type plasminogen activator
LigandBDBM50102780
Substrate/Competitorn/a
Meas. Tech.ChEMBL_226009 (CHEMBL842150)
Ki 8±n/a nM
Citation Mackman, RLKatz, BABreitenbucher, JGHui, HCVerner, ELuong, CLiu, LSprengeler, PA Exploiting subsite S1 of trypsin-like serine proteases for selectivity: potent and selective inhibitors of urokinase-type plasminogen activator. J Med Chem44:3856-71 (2001) Urokinase-type plasminogen activator
Name:Urokinase-type plasminogen activator
Type:Enzyme
Mol. Mass.:48528.62
Organism:Homo sapiens (Human)
Description:P00749
Residue:431
BDBM50102780
NameBDBM50102780
Synonyms:2-(2-Hydroxy-3-phenyl-phenyl)-1H-indole-5-carboxamidine 3-{5-[AMINO(IMINIO)METHYL]-1H-INDOL-2-YL}-1,1'-BIPHENYL-2-OLATE | CHEMBL96433
TypeSmall organic molecule
Emp. Form.C21H17N3O
Mol. Mass.327.3792
SMILESNC(=N)c1ccc2[nH]c(cc2c1)-c1cccc(-c2ccccc2)c1O