Reaction Details
TargetTissue-type plasminogen activator
LigandBDBM50106243
Substrate/Competitorn/a
Meas. Tech.ChEMBL_222779 (CHEMBL847108)
Ki 210±n/a nM
Citation Mackman, RLKatz, BABreitenbucher, JGHui, HCVerner, ELuong, CLiu, LSprengeler, PA Exploiting subsite S1 of trypsin-like serine proteases for selectivity: potent and selective inhibitors of urokinase-type plasminogen activator. J Med Chem44:3856-71 (2001) Tissue-type plasminogen activator
Name:Tissue-type plasminogen activator
Type:Enzyme
Mol. Mass.:62931.08
Organism:Homo sapiens (Human)
Description:n/a
Residue:562
BDBM50106243
NameBDBM50106243
Synonyms:2-(2-Hydroxy-biphenyl-3-yl)-6-methyl-1H-indole-5-carboxamidine | CHEMBL127278
TypeSmall organic molecule
Emp. Form.C22H19N3O
Mol. Mass.341.4058
SMILESCc1cc2[nH]c(cc2cc1C(N)=N)-c1cccc(-c2ccccc2)c1O