Reaction Details
TargetD(3) dopamine receptor
LigandBDBM50106250
Substrate/Competitorn/a
Meas. Tech.ChEMBL_62122 (CHEMBL673443)
Ki 23±n/a nM
Citation Russell, MGBaker, RJBarden, LBeer, MSBristow, LBroughton, HBKnowles, MMcAllister, GPatel, SCastro, JL N-Arylsulfonylindole derivatives as serotonin 5-HT(6) receptor ligands. J Med Chem44:3881-95 (2001) D(3) dopamine receptor
Name:D(3) dopamine receptor
Type:n/a
Mol. Mass.:44243.43
Organism:Homo sapiens (Human)
Description:n/a
Residue:400
BDBM50106250
NameBDBM50106250
Synonyms:CHEMBL93868 [2-(1-Benzenesulfonyl-1H-indol-3-yl)-ethyl]-dimethyl-amine
TypeSmall organic molecule
Emp. Form.C18H20N2O2S
Mol. Mass.328.429
SMILESCN(C)CCc1cn(c2ccccc12)S(=O)(=O)c1ccccc1