Reaction Details
Target5-hydroxytryptamine receptor 6
LigandBDBM50106269
Substrate/Competitorn/a
Meas. Tech.ChEMBL_3611 (CHEMBL618094)
Ki 1.3±n/a nM
Citation Russell, MGBaker, RJBarden, LBeer, MSBristow, LBroughton, HBKnowles, MMcAllister, GPatel, SCastro, JL N-Arylsulfonylindole derivatives as serotonin 5-HT(6) receptor ligands. J Med Chem44:3881-95 (2001) 5-hydroxytryptamine receptor 6
Name:5-hydroxytryptamine receptor 6
Type:G Protein-Coupled Receptor (GPCR)
Mol. Mass.:46968.43
Organism:Homo sapiens (Human)
Description:P50406
Residue:440
BDBM50106269
NameBDBM50106269
Synonyms:(2-{2-[3-(3-Methoxy-benzyl)-[1,2,4]oxadiazol-5-yl]-1H-indol-3-yl}-ethyl)-dimethyl-amine | CHEMBL329329
TypeSmall organic molecule
Emp. Form.C22H24N4O2
Mol. Mass.376.4516
SMILESCOc1cccc(Cc2noc(n2)-c2[nH]c3ccccc3c2CCN(C)C)c1