Reaction Details
TargetEndothelin-1 receptor
LigandBDBM50066391
Substrate/Competitorn/a
Meas. Tech.ChEMBL_65488 (CHEMBL682363)
IC50 0.49±n/a nM
Citation Jae, HSWinn, Mvon Geldern, TWSorensen, BKChiou, WJNguyen, BMarsh, KCOpgenorth, TJ Pyrrolidine-3-carboxylic acids as endothelin antagonists. 5. Highly selective, potent, and orally active ET(A) antagonists. J Med Chem44:3978-84 (2001) Endothelin-1 receptor
Name:Endothelin-1 receptor
Type:Enzyme Catalytic Domain
Mol. Mass.:48736.88
Organism:Homo sapiens (Human)
Description:P25101
Residue:427
BDBM50066391
NameBDBM50066391
Synonyms:(2S,3R,4S)-1-Dibutylcarbamoylmethyl-2-(2,2-dimethyl-pentyl)-4-(7-methoxy-benzo[1,3]dioxol-5-yl)-pyrrolidine-3-carboxylic acid CHEMBL111612
TypeSmall organic molecule
Emp. Form.C30H48N2O6
Mol. Mass.532.7119
SMILESCCCCN(CCCC)C(=O)CN1C[C@@H]([C@H]([C@@H]1CC(C)(C)CCC)C(O)=O)c1cc2OCOc2c(OC)c1