Reaction Details
TargetEndothelin receptor type B
LigandBDBM50056081
Substrate/Competitorn/a
Meas. Tech.ChEMBL_63864 (CHEMBL673048)
IC50 960±n/a nM
Citation Jae, HSWinn, Mvon Geldern, TWSorensen, BKChiou, WJNguyen, BMarsh, KCOpgenorth, TJ Pyrrolidine-3-carboxylic acids as endothelin antagonists. 5. Highly selective, potent, and orally active ET(A) antagonists. J Med Chem44:3978-84 (2001) Endothelin receptor type B
Name:Endothelin receptor type B
Type:Enzyme Catalytic Domain
Mol. Mass.:49664.00
Organism:Homo sapiens (Human)
Description:ENDOTHELIN B EDNRB HUMAN::P24530
Residue:442
BDBM50056081
NameBDBM50056081
Synonyms:(2R,3R,4S)-1-Dibutylcarbamoylmethyl-4-(2,3-dihydro-benzofuran-6-yl)-2-(4-methoxy-phenyl)-pyrrolidine-3-carboxylic acid CHEMBL326191
TypeSmall organic molecule
Emp. Form.C30H40N2O5
Mol. Mass.508.649
SMILESCCCCN(CCCC)C(=O)CN1C[C@@H]([C@H]([C@@H]1c1ccc(OC)cc1)C(O)=O)c1ccc2CCOc2c1