Reaction Details
TargetInsulin-like growth factor-binding protein 2
LigandBDBM50106431
Substrate/Competitorn/a
Meas. Tech.ChEMBL_90402 (CHEMBL698357)
Ki 2.1±n/a nM
Citation Chen, CZhu, YFLiu, XJLu, ZXXie, QLing, N Discovery of a series of nonpeptide small molecules that inhibit the binding of insulin-like growth factor (IGF) to IGF-binding proteins. J Med Chem44:4001-10 (2001) Insulin-like growth factor-binding protein 2
Name:Insulin-like growth factor-binding protein 2
Type:PROTEIN
Mol. Mass.:34820.33
Organism:Homo sapiens (Human)
Description:ChEMBL_90402
Residue:325
BDBM50106431
NameBDBM50106431
Synonyms:1-(3,4-Dihydroxy-benzoyl)-6,7-dihydroxy-isoquinoline-3-carboxylic acid | CHEMBL292700
TypeSmall organic molecule
Emp. Form.C17H11NO7
Mol. Mass.341.2717
SMILESOC(=O)c1cc2cc(O)c(O)cc2c(n1)C(=O)c1ccc(O)c(O)c1