Reaction Details
TargetDual specificity protein phosphatase 3
LigandBDBM50106497
Substrate/Competitorn/a
Meas. Tech.ChEMBL_214523 (CHEMBL819515)
IC50 4000±n/a nM
Citation Lazo, JSAslan, DCSouthwick, ECCooley, KADucruet, APJoo, BVogt, AWipf, P Discovery and biological evaluation of a new family of potent inhibitors of the dual specificity protein phosphatase Cdc25. J Med Chem44:4042-9 (2001) Dual specificity protein phosphatase 3
Name:Dual specificity protein phosphatase 3
Type:Hydrolase
Mol. Mass.:20480.58
Organism:Homo sapiens (Human)
Description:n/a
Residue:185
BDBM50106497
NameBDBM50106497
Synonyms:6-Chloro-7-(2-morpholin-4-yl-ethylamino)-quinoline-5,8-dione CHEMBL337173 | NSC-663284
TypeSmall organic molecule
Emp. Form.C15H16ClN3O3
Mol. Mass.321.759
SMILESOc1c(Cl)c(N=CCN2CCOCC2)c(O)c2ncccc12