Reaction Details
TargetMethylated-DNA--protein-cysteine methyltransferase
LigandBDBM50106510
Substrate/Competitorn/a
Meas. Tech.ChEMBL_103719 (CHEMBL712287)
IC50 30±n/a nM
Citation Reinhard, JHull, WEvon der Lieth, CWEichhorn, UKliem, HCKaina, BWiessler, M Monosaccharide-linked inhibitors of O(6)-methylguanine-DNA methyltransferase (MGMT): synthesis, molecular modeling, and structure-activity relationships. J Med Chem44:4050-61 (2001) Methylated-DNA--protein-cysteine methyltransferase
Name:Methylated-DNA--protein-cysteine methyltransferase
Type:PROTEIN
Mol. Mass.:21651.27
Organism:Homo sapiens (Human)
Description:ChEMBL_144711
Residue:207
BDBM50106510
NameBDBM50106510
Synonyms:2-{12-[2-Amino-6-(4-bromo-thiophen-2-ylmethoxy)-purin-9-yl]-dodecyloxy}-6-hydroxymethyl-tetrahydro-pyran-3,4,5-triol | CHEMBL129850
TypeSmall organic molecule
Emp. Form.C28H42BrN5O7S
Mol. Mass.672.631
SMILESNc1nc(OCc2cc(Br)cs2)c2ncn(CCCCCCCCCCCCO[C@H]3OC(CO)[C@@H](O)[C@@H](O)C3O)c2n1