Reaction Details
TargetMethylated-DNA--protein-cysteine methyltransferase
LigandBDBM50106514
Substrate/Competitorn/a
Meas. Tech.ChEMBL_103719 (CHEMBL712287)
IC50 250±n/a nM
Citation Reinhard, JHull, WEvon der Lieth, CWEichhorn, UKliem, HCKaina, BWiessler, M Monosaccharide-linked inhibitors of O(6)-methylguanine-DNA methyltransferase (MGMT): synthesis, molecular modeling, and structure-activity relationships. J Med Chem44:4050-61 (2001) Methylated-DNA--protein-cysteine methyltransferase
Name:Methylated-DNA--protein-cysteine methyltransferase
Type:PROTEIN
Mol. Mass.:21651.27
Organism:Homo sapiens (Human)
Description:ChEMBL_144711
Residue:207
BDBM50106514
NameBDBM50106514
Synonyms:2-{4-[2-Amino-6-(4-bromo-thiophen-2-ylmethoxy)-purin-9-yl]-but-2-ynyloxy}-6-hydroxymethyl-tetrahydro-pyran-3,4,5-triol | CHEMBL336215
TypeSmall organic molecule
Emp. Form.C20H22BrN5O7S
Mol. Mass.556.387
SMILESNc1nc(OCc2cc(Br)cs2)c2ncn(CC#CCO[C@H]3OC(CO)[C@@H](O)[C@@H](O)C3O)c2n1