Reaction Details
TargetProstaglandin E2 receptor EP3 subtype
LigandBDBM50106547
Substrate/Competitorn/a
Meas. Tech.ChEMBL_158315 (CHEMBL764941)
IC50 186±n/a nM
Citation Soper, DLMilbank, JBMieling, GEDirr, MJKende, ASCooper, RJee, WSYao, WChen, JLBodman, MLundy, MWDe, BStella, MEEbetino, FHWang, YdeLong, MAWos, JA Synthesis and biological evaluation of prostaglandin-F alkylphosphinic acid derivatives as bone anabolic agents for the treatment of osteoporosis. J Med Chem44:4157-69 (2001) Prostaglandin E2 receptor EP3 subtype
Name:Prostaglandin E2 receptor EP3 subtype
Type:Enzyme
Mol. Mass.:43335.03
Organism:Homo sapiens (Human)
Description:P43115
Residue:390
BDBM50106547
NameBDBM50106547
Synonyms:7-[3,5-Dihydroxy-2-(3-hydroxy-4-phenoxy-but-1-enyl)-cyclopentyl]-hept-5-enoic acid PGF2Alpha,16-Phenoxy
TypeSmall organic molecule
Emp. Form.C22H30O6
Mol. Mass.390.47
SMILESO[C@@H](COc1ccccc1)\C=C\[C@H]1[C@H](O)C[C@H](O)[C@@H]1C\C=C/CCCC(O)=O