Reaction Details
TargetProstacyclin receptor
LigandBDBM50035622
Substrate/Competitorn/a
Meas. Tech.ChEMBL_158464 (CHEMBL763223)
IC50>100000±n/a nM
Citation Soper, DLMilbank, JBMieling, GEDirr, MJKende, ASCooper, RJee, WSYao, WChen, JLBodman, MLundy, MWDe, BStella, MEEbetino, FHWang, YdeLong, MAWos, JA Synthesis and biological evaluation of prostaglandin-F alkylphosphinic acid derivatives as bone anabolic agents for the treatment of osteoporosis. J Med Chem44:4157-69 (2001) Prostacyclin receptor
Name:Prostacyclin receptor
Type:G Protein-Coupled Receptor (GPCR)
Mol. Mass.:40968.22
Organism:Homo sapiens (Human)
Description:The membranes prepared from human platelet were used in binding assay.
Residue:386
BDBM50035622
NameBDBM50035622
Synonyms:(5Z,13E,15S)-9alpha,11alpha,15-trihydroxyprosta-5,13-dien-1-oic acid DINOPROST l-PGF2-alpha prostaglandin F2alpha
TypeSmall organic molecule
Emp. Form.C20H34O5
Mol. Mass.354.481
SMILESCCCCC[C@H](O)\C=C\[C@H]1[C@H](O)C[C@H](O)[C@@H]1C\C=C/CCCC(O)=O