Reaction Details
TargetSubstance-K receptor
LigandBDBM50106891
Substrate/Competitorn/a
Meas. Tech.ChEBML_209021
IC50 5.5±n/a nM
Citation Gerspacher, MLa Vecchia, LMah, Rvon Sprecher, AAnderson, GPSubramanian, NHauser, KBammerlin, HKimmel, SPawelzik, VRyffel, KBall, HA Dual neurokinin NK(1)/NK(2) antagonists: N-[(R,R)-(E)-1-arylmethyl-3-(2-oxo-azepan-3-yl)carbamoyl]allyl-N-methyl-3,5-bis(trifluoromethyl)benzamides and 3-[N'-3,5-bis(trifluoromethyl)benzoyl-N-arylmethyl-N'-methylhydrazino]-N-[(R)-2-oxo-azepan-3-yl]propionamides. Bioorg Med Chem Lett11:3081-4 (2001) Substance-K receptor
Name:Substance-K receptor
Type:Protein
Mol. Mass.:44455.78
Organism:Homo sapiens (Human)
Description:P21452
Residue:398
BDBM50106891
NameBDBM50106891
Synonyms:3-[N'-(3,5-Bis-trifluoromethyl-benzoyl)-N-(3,4-dichloro-benzyl)-N'-methyl-hydrazino]-N-((R)-2-oxo-azepan-3-yl)-propionamide | CHEMBL318606
TypeSmall organic molecule
Emp. Form.C26H26Cl2F6N4O3
Mol. Mass.627.406
SMILESCN(N(CCC(=O)N[C@@H]1CCCCNC1=O)Cc1ccc(Cl)c(Cl)c1)C(=O)c1cc(cc(c1)C(F)(F)F)C(F)(F)F