Reaction Details
TargetSubstance-P receptor
LigandBDBM50106898
Substrate/Competitorn/a
Meas. Tech.ChEBML_205389
IC50 0.500000±n/a nM
Citation Gerspacher, MLa Vecchia, LMah, Rvon Sprecher, AAnderson, GPSubramanian, NHauser, KBammerlin, HKimmel, SPawelzik, VRyffel, KBall, HA Dual neurokinin NK(1)/NK(2) antagonists: N-[(R,R)-(E)-1-arylmethyl-3-(2-oxo-azepan-3-yl)carbamoyl]allyl-N-methyl-3,5-bis(trifluoromethyl)benzamides and 3-[N'-3,5-bis(trifluoromethyl)benzoyl-N-arylmethyl-N'-methylhydrazino]-N-[(R)-2-oxo-azepan-3-yl]propionamides. Bioorg Med Chem Lett11:3081-4 (2001) Substance-P receptor
Name:Substance-P receptor
Type:G Protein-Coupled Receptor (GPCR)
Mol. Mass.:46254.43
Organism:Homo sapiens (Human)
Description:P25103
Residue:407
BDBM50106898
NameBDBM50106898
Synonyms:CHEMBL317632 | N-Methyl-N-[(E)-(R)-1-(1-methyl-1H-indol-3-ylmethyl)-3-((R)-2-oxo-azepan-3-ylcarbamoyl)-allyl]-3,5-bis-trifluoromethyl-benzamide
TypeSmall organic molecule
Emp. Form.C30H30F6N4O3
Mol. Mass.608.5746
SMILESCN([C@H](Cc1cn(C)c2ccccc12)\C=C\C(=O)N[C@@H]1CCCCNC1=O)C(=O)c1cc(cc(c1)C(F)(F)F)C(F)(F)F