Reaction Details
TargetReverse transcriptase/RNaseH
LigandBDBM50403886
Substrate/Competitorn/a
Meas. Tech.ChEBML_195690
EC50>2000±n/a nM
Citation Chamorro, CLobatón, EBonache, MCDe Clercq, EBalzarini, JVelázquez, SSan-Félix, ACamarasa, MJ Identification of a novel family of nucleosides that specifically inhibit HIV-1 reverse transcriptase. Bioorg Med Chem Lett11:3085-8 (2001) Reverse transcriptase/RNaseH
Name:Reverse transcriptase/RNaseH
Type:PROTEIN
Mol. Mass.:65229.15
Organism:Human immunodeficiency virus 1
Description:ChEMBL_1473730
Residue:566
BDBM50403886
NameBDBM50403886
Synonyms:CHEMBL102269
TypeSmall organic molecule
Emp. Form.C31H50N2O7Si2
Mol. Mass.618.9089
SMILESCc1cn(C2OC(CO[Si](C)(C)C(C)(C)C)CC2O[Si](C)(C)C(C)(C)C)c(=O)n(CC(=O)OCc2ccccc2)c1=O