Reaction Details
TargetReverse transcriptase/RNaseH
LigandBDBM50403889
Substrate/Competitorn/a
Meas. Tech.ChEBML_195690
EC50>250000±n/a nM
Citation Chamorro, CLobatón, EBonache, MCDe Clercq, EBalzarini, JVelázquez, SSan-Félix, ACamarasa, MJ Identification of a novel family of nucleosides that specifically inhibit HIV-1 reverse transcriptase. Bioorg Med Chem Lett11:3085-8 (2001) Reverse transcriptase/RNaseH
Name:Reverse transcriptase/RNaseH
Type:PROTEIN
Mol. Mass.:65229.15
Organism:Human immunodeficiency virus 1
Description:ChEMBL_1473730
Residue:566
BDBM50403889
NameBDBM50403889
Synonyms:CHEMBL318807
TypeSmall organic molecule
Emp. Form.C25H36N2O6Si
Mol. Mass.488.6486
SMILESCc1cn(C2CCC(CO[Si](C)(C)C(C)(C)C)O2)c(=O)n(CC(=O)OCc2ccccc2)c1=O