Reaction Details
TargetReverse transcriptase/RNaseH
LigandBDBM50403890
Substrate/Competitorn/a
Meas. Tech.ChEBML_195690
EC50>250000±n/a nM
Citation Chamorro, CLobatón, EBonache, MCDe Clercq, EBalzarini, JVelázquez, SSan-Félix, ACamarasa, MJ Identification of a novel family of nucleosides that specifically inhibit HIV-1 reverse transcriptase. Bioorg Med Chem Lett11:3085-8 (2001) Reverse transcriptase/RNaseH
Name:Reverse transcriptase/RNaseH
Type:PROTEIN
Mol. Mass.:65229.15
Organism:Human immunodeficiency virus 1
Description:ChEMBL_1473730
Residue:566
BDBM50403890
NameBDBM50403890
Synonyms:CHEMBL608622
TypeSmall organic molecule
Emp. Form.C12H16N2O8
Mol. Mass.316.264
SMILESCc1cn(C2O[C@H](CO)[C@@H](O)[C@H]2O)c(=O)n(CC(O)=O)c1=O