Reaction Details
TargetReverse transcriptase/RNaseH
LigandBDBM50403892
Substrate/Competitorn/a
Meas. Tech.ChEBML_195690
EC50 4000±n/a nM
Citation Chamorro, CLobatón, EBonache, MCDe Clercq, EBalzarini, JVelázquez, SSan-Félix, ACamarasa, MJ Identification of a novel family of nucleosides that specifically inhibit HIV-1 reverse transcriptase. Bioorg Med Chem Lett11:3085-8 (2001) Reverse transcriptase/RNaseH
Name:Reverse transcriptase/RNaseH
Type:PROTEIN
Mol. Mass.:65229.15
Organism:Human immunodeficiency virus 1
Description:ChEMBL_1473730
Residue:566
BDBM50403892
NameBDBM50403892
Synonyms:CHEMBL3142818 | CHEMBL321135
TypeSmall organic molecule
Emp. Form.C25H36N2O8Si
Mol. Mass.520.6474
SMILESCc1cn([C@@H]2O[C@H](CO)[C@@H](O)[C@H]2O[Si](C)(C)C(C)(C)C)c(=O)n(CC(=O)OCc2ccccc2)c1=O