Reaction Details
TargetPeroxisome proliferator-activated receptor gamma
LigandBDBM28681
Substrate/Competitorn/a
Meas. Tech.ChEBML_154185
EC50 43±n/a nM
Citation Liu, KGLambert, MHAyscue, AHHenke, BRLeesnitzer, LMOliver, WRPlunket, KDXu, HESternbach, DDWillson, TM Synthesis and biological activity of L-tyrosine-based PPARgamma agonists with reduced molecular weight. Bioorg Med Chem Lett11:3111-3 (2001) Peroxisome proliferator-activated receptor gamma
Name:Peroxisome proliferator-activated receptor gamma
Type:Nuclear Receptor
Mol. Mass.:57613.46
Organism:Homo sapiens (Human)
Description:P37231
Residue:505
BDBM28681
NameBDBM28681
Synonyms:5-[(4-{2-[methyl(pyridin-2-yl)amino]ethoxy}phenyl)methyl]-1,3-thiazolidine-2,4-dione BRL 49653 CHEMBL121 [3H]rosiglitazone rosiglitazone
Typeradiolabeled ligand
Emp. Form.C18H19N3O3S
Mol. Mass.357.427
SMILESCN(CCOc1ccc(Cc2sc(=O)[nH]c2O)cc1)c1ccccn1