Reaction Details
TargetPeroxisome proliferator-activated receptor gamma
LigandBDBM50106965
Substrate/Competitorn/a
Meas. Tech.ChEMBL_154185 (CHEMBL761655)
EC50 590±n/a nM
Citation Liu, KGLambert, MHAyscue, AHHenke, BRLeesnitzer, LMOliver, WRPlunket, KDXu, HESternbach, DDWillson, TM Synthesis and biological activity of L-tyrosine-based PPARgamma agonists with reduced molecular weight. Bioorg Med Chem Lett11:3111-3 (2001) Peroxisome proliferator-activated receptor gamma
Name:Peroxisome proliferator-activated receptor gamma
Type:Nuclear Receptor
Mol. Mass.:57613.46
Organism:Homo sapiens (Human)
Description:P37231
Residue:505
BDBM50106965
NameBDBM50106965
Synonyms:(S)-3-{4-[2-(5-Methyl-2-phenyl-oxazol-4-yl)-ethoxy]-phenyl}-2-(pyrimidin-2-ylamino)-propionic acid | CHEMBL104494
TypeSmall organic molecule
Emp. Form.C25H24N4O4
Mol. Mass.444.4825
SMILESCc1oc(nc1CCOc1ccc(C[C@H](Nc2ncccn2)C(O)=O)cc1)-c1ccccc1