Reaction Details
TargetPeroxisome proliferator-activated receptor gamma
LigandBDBM50106961
Substrate/Competitorn/a
Meas. Tech.ChEMBL_154353 (CHEMBL759115)
Ki 2600±n/a nM
Citation Liu, KGLambert, MHAyscue, AHHenke, BRLeesnitzer, LMOliver, WRPlunket, KDXu, HESternbach, DDWillson, TM Synthesis and biological activity of L-tyrosine-based PPARgamma agonists with reduced molecular weight. Bioorg Med Chem Lett11:3111-3 (2001) Peroxisome proliferator-activated receptor gamma
Name:Peroxisome proliferator-activated receptor gamma
Type:Nuclear Receptor
Mol. Mass.:57613.46
Organism:Homo sapiens (Human)
Description:P37231
Residue:505
BDBM50106961
NameBDBM50106961
Synonyms:(S)-2-Acetylamino-3-{4-[2-(5-methyl-2-phenyl-oxazol-4-yl)-ethoxy]-phenyl}-propionic acid | CHEMBL107741
TypeSmall organic molecule
Emp. Form.C23H24N2O5
Mol. Mass.408.4471
SMILESCC(=O)N[C@@H](Cc1ccc(OCCc2nc(oc2C)-c2ccccc2)cc1)C(O)=O