Reaction Details
TargetPeroxisome proliferator-activated receptor alpha
LigandBDBM50106967
Substrate/Competitorn/a
Meas. Tech.ChEBML_153542
EC50 6900±n/a nM
Citation Liu, KGLambert, MHAyscue, AHHenke, BRLeesnitzer, LMOliver, WRPlunket, KDXu, HESternbach, DDWillson, TM Synthesis and biological activity of L-tyrosine-based PPARgamma agonists with reduced molecular weight. Bioorg Med Chem Lett11:3111-3 (2001) Peroxisome proliferator-activated receptor alpha
Name:Peroxisome proliferator-activated receptor alpha
Type:Enzyme
Mol. Mass.:52222.08
Organism:Homo sapiens (Human)
Description:Q07869
Residue:468
BDBM50106967
NameBDBM50106967
Synonyms:(S)-3-{4-[2-(5-Methyl-2-phenyl-oxazol-4-yl)-ethoxy]-phenyl}-2-morpholin-4-yl-propionic acid | CHEMBL104246
TypeSmall organic molecule
Emp. Form.C25H28N2O5
Mol. Mass.436.5002
SMILESCc1oc(nc1CCOc1ccc(C[C@H](N2CCOCC2)C(O)=O)cc1)-c1ccccc1