Reaction Details
TargetPeroxisome proliferator-activated receptor gamma
LigandBDBM50106962
Substrate/Competitorn/a
Meas. Tech.ChEMBL_154353 (CHEMBL759115)
Ki 2100±n/a nM
Citation Liu, KGLambert, MHAyscue, AHHenke, BRLeesnitzer, LMOliver, WRPlunket, KDXu, HESternbach, DDWillson, TM Synthesis and biological activity of L-tyrosine-based PPARgamma agonists with reduced molecular weight. Bioorg Med Chem Lett11:3111-3 (2001) Peroxisome proliferator-activated receptor gamma
Name:Peroxisome proliferator-activated receptor gamma
Type:Nuclear Receptor
Mol. Mass.:57613.46
Organism:Homo sapiens (Human)
Description:P37231
Residue:505
BDBM50106962
NameBDBM50106962
Synonyms:(S)-2-Methylamino-3-{4-[2-(5-methyl-2-phenyl-oxazol-4-yl)-ethoxy]-phenyl}-propionic acid | CHEMBL104458
TypeSmall organic molecule
Emp. Form.C22H24N2O4
Mol. Mass.380.437
SMILESCN[C@@H](Cc1ccc(OCCc2nc(oc2C)-c2ccccc2)cc1)C(O)=O