Reaction Details
TargetGenome polyprotein
LigandBDBM22851
Substrate/Competitorn/a
Meas. Tech.ChEBML_160894
IC50 8200±n/a nM
Citation Singh, SBGraham, PLReamer, RACordingley, MG Discovery, total synthesis, HRV 3C-protease inhibitory activity, and structure-activity relationships of 2-methoxystypandrone and its analogues. Bioorg Med Chem Lett11:3143-6 (2001) Genome polyprotein
Name:Genome polyprotein
Type:PROTEIN
Mol. Mass.:44361.04
Organism:Human rhinovirus B
Description:ChEMBL_158953
Residue:401
BDBM22851
NameBDBM22851
Synonyms:1,2-Dione-Based Compound, 8 1,2-naphthoquinone cid_10667
TypeSmall organic molecule
Emp. Form.C10H6O2
Mol. Mass.158.1534
SMILESO=C1C=Cc2ccccc2C1=O