Reaction Details
TargetPapain
LigandBDBM50107000
Substrate/Competitorn/a
Meas. Tech.ChEBML_152640
IC50 23000±n/a nM
Citation Singh, SBGraham, PLReamer, RACordingley, MG Discovery, total synthesis, HRV 3C-protease inhibitory activity, and structure-activity relationships of 2-methoxystypandrone and its analogues. Bioorg Med Chem Lett11:3143-6 (2001) Papain
Name:Papain
Type:Enzyme
Mol. Mass.:38923.01
Organism:Carica papaya
Description:Papain was purchased from Sigma, Germany.
Residue:345
BDBM50107000
NameBDBM50107000
Synonyms:6-Acetyl-5-hydroxy-2-methoxy-7-methyl-[1,4]naphthoquinone | CHEMBL322776
TypeSmall organic molecule
Emp. Form.C14H12O5
Mol. Mass.260.2421
SMILESCOC1=CC(=O)c2c(O)c(C(C)=O)c(C)cc2C1=O