Reaction Details
TargetPapain
LigandBDBM50107007
Substrate/Competitorn/a
Meas. Tech.ChEBML_152640
IC50 33000±n/a nM
Citation Singh, SBGraham, PLReamer, RACordingley, MG Discovery, total synthesis, HRV 3C-protease inhibitory activity, and structure-activity relationships of 2-methoxystypandrone and its analogues. Bioorg Med Chem Lett11:3143-6 (2001) Papain
Name:Papain
Type:Enzyme
Mol. Mass.:38923.01
Organism:Carica papaya
Description:Papain was purchased from Sigma, Germany.
Residue:345
BDBM50107007
NameBDBM50107007
Synonyms:Acetic acid 2-acetyl-6-methoxy-3-methyl-5,8-dioxo-5,8-dihydro-naphthalen-1-yl ester | CHEMBL104123
TypeSmall organic molecule
Emp. Form.C16H14O6
Mol. Mass.302.2788
SMILESCOC1=CC(=O)c2c(OC(C)=O)c(C(C)=O)c(C)cc2C1=O