Reaction Details
TargetProtein kinase C alpha type
LigandBDBM50107116
Substrate/Competitorn/a
Meas. Tech.ChEMBL_152973 (CHEMBL760366)
Ki 6.9±n/a nM
Citation Lee, JHan, KCKang, JHPearce, LLLewin, NEYan, SBenzaria, SNicklaus, MCBlumberg, PMMarquez, VE Conformationally constrained analogues of diacylglycerol. 18. The incorporation of a hydroxamate moiety into diacylglycerol-lactones reduces lipophilicity and helps discriminate between sn-1 and sn-2 binding modes to protein kinase C (PK-C). Implications for isozyme specificity. J Med Chem44:4309-12 (2001) Protein kinase C alpha type
Name:Protein kinase C alpha type
Type:Enzyme
Mol. Mass.:76755.65
Organism:Homo sapiens (Human)
Description:The recombinant human PKC enzymes were produced using a baculovirus expression system in SF9 cells
Residue:672
BDBM50107116
NameBDBM50107116
Synonyms:3-Isopropyl-4-methyl-pentanoic acid 2-hydroxymethyl-4-(3-isobutyl-5-methyl-hexylidene)-5-oxo-tetrahydro-furan-2-ylmethyl ester CHEMBL137597
TypeSmall organic molecule
Emp. Form.C26H46O5
Mol. Mass.438.6404
SMILESCC(C)CC(C\C=C1\CC(CO)(COC(=O)CC(C(C)C)C(C)C)OC1=O)CC(C)C