Reaction Details
TargetIntegrin alpha-L
LigandBDBM50107166
Substrate/Competitorn/a
Meas. Tech.ChEMBL_88923 (CHEMBL698471)
IC50 5±n/a nM
Citation Winn, MReilly, EBLiu, GHuth, JRJae, HSFreeman, JPei, ZXin, ZLynch, JKester, Jvon Geldern, TWLeitza, SDeVries, PDickinson, RMussatto, DOkasinski, GF Discovery of novel p-arylthio cinnamides as antagonists of leukocyte function-associated antigen-1/intercellular adhesion molecule-1 interaction. 4. Structure-activity relationship of substituents on the benzene ring of the cinnamide. J Med Chem44:4393-403 (2001) Integrin alpha-L
Name:Integrin alpha-L
Type:PROTEIN
Mol. Mass.:128748.90
Organism:Homo sapiens (Human)
Description:ChEMBL_629045
Residue:1170
BDBM50107166
NameBDBM50107166
Synonyms:1-{3-[3-Chloro-4-(2,3-dihydro-benzo[1,4]dioxin-6-ylsulfanyl)-2-trifluoromethyl-phenyl]-acryloyl}-piperidine-4-carboxylic acid | CHEMBL139349
TypeSmall organic molecule
Emp. Form.C24H21ClF3NO5S
Mol. Mass.527.94
SMILESOC(=O)C1CCN(CC1)C(=O)\C=C\c1ccc(Sc2ccc3OCCOc3c2)c(Cl)c1C(F)(F)F