Reaction Details
TargetIntegrin alpha-L/beta-2
LigandBDBM50107164
Substrate/Competitorn/a
Meas. Tech.ChEMBL_91794 (CHEMBL702301)
IC50 6±n/a nM
Citation Winn, MReilly, EBLiu, GHuth, JRJae, HSFreeman, JPei, ZXin, ZLynch, JKester, Jvon Geldern, TWLeitza, SDeVries, PDickinson, RMussatto, DOkasinski, GF Discovery of novel p-arylthio cinnamides as antagonists of leukocyte function-associated antigen-1/intercellular adhesion molecule-1 interaction. 4. Structure-activity relationship of substituents on the benzene ring of the cinnamide. J Med Chem44:4393-403 (2001) Integrin alpha-L/beta-2
Name:Integrin alpha-L/beta-2
Type:n/a
Mol. Mass.:n/a
Description:ASSAY_ID of EBI is 32646
Components:This complex has 2 components.
Component 1
Name:Integrin alpha-L
Synonyms:CD11 antigen-like family member A CD_antigen=CD11a ITGAL LFA-1A Leukocyte adhesion glycoprotein LFA-1 alpha chain | Leukocyte function-associated molecule 1 alpha chain
Type:PROTEIN
Mol. Mass.:128748.90
Organism:Homo sapiens (Human)
Description:ChEMBL_629045
Residue:1170
Component 2
Name:Integrin beta-2
Synonyms:CD18 ITGB2 MFI7
Type:PROTEIN
Mol. Mass.:84785.60
Organism:Homo sapiens (Human)
Description:EBI_12662
Residue:769
BDBM50107164
NameBDBM50107164
Synonyms:3-[2,3-Dichloro-4-(2-methoxy-phenylsulfanyl)-phenyl]-1-morpholin-4-yl-propenone | CHEMBL344897
TypeSmall organic molecule
Emp. Form.C20H19Cl2NO3S
Mol. Mass.424.341
SMILESCOc1ccccc1Sc1ccc(\C=C\C(=O)N2CCOCC2)c(Cl)c1Cl