Reaction Details
TargetIntegrin alpha-L/beta-2
LigandBDBM50107173
Substrate/Competitorn/a
Meas. Tech.ChEMBL_91799 (CHEMBL700985)
IC50 4±n/a nM
Citation Winn, MReilly, EBLiu, GHuth, JRJae, HSFreeman, JPei, ZXin, ZLynch, JKester, Jvon Geldern, TWLeitza, SDeVries, PDickinson, RMussatto, DOkasinski, GF Discovery of novel p-arylthio cinnamides as antagonists of leukocyte function-associated antigen-1/intercellular adhesion molecule-1 interaction. 4. Structure-activity relationship of substituents on the benzene ring of the cinnamide. J Med Chem44:4393-403 (2001) Integrin alpha-L/beta-2
Name:Integrin alpha-L/beta-2
Type:n/a
Mol. Mass.:n/a
Description:ASSAY_ID of EBI is 32646
Components:This complex has 2 components.
Component 1
Name:Integrin alpha-L
Synonyms:CD11 antigen-like family member A CD_antigen=CD11a ITGAL LFA-1A Leukocyte adhesion glycoprotein LFA-1 alpha chain | Leukocyte function-associated molecule 1 alpha chain
Type:PROTEIN
Mol. Mass.:128748.90
Organism:Homo sapiens (Human)
Description:ChEMBL_629045
Residue:1170
Component 2
Name:Integrin beta-2
Synonyms:CD18 ITGB2 MFI7
Type:PROTEIN
Mol. Mass.:84785.60
Organism:Homo sapiens (Human)
Description:EBI_12662
Residue:769
BDBM50107173
NameBDBM50107173
Synonyms:1-{3-[3-Chloro-4-(2-methoxy-phenylsulfanyl)-2-trifluoromethyl-phenyl]-acryloyl}-piperidine-4-carboxylic acid | CHEMBL139068
TypeSmall organic molecule
Emp. Form.C23H21ClF3NO4S
Mol. Mass.499.93
SMILESCOc1ccccc1Sc1ccc(\C=C\C(=O)N2CCC(CC2)C(O)=O)c(c1Cl)C(F)(F)F