Reaction Details
TargetIntegrin alpha-L
LigandBDBM50107160
Substrate/Competitorn/a
Meas. Tech.ChEMBL_88945 (CHEMBL699116)
IC50 55±n/a nM
Citation Winn, MReilly, EBLiu, GHuth, JRJae, HSFreeman, JPei, ZXin, ZLynch, JKester, Jvon Geldern, TWLeitza, SDeVries, PDickinson, RMussatto, DOkasinski, GF Discovery of novel p-arylthio cinnamides as antagonists of leukocyte function-associated antigen-1/intercellular adhesion molecule-1 interaction. 4. Structure-activity relationship of substituents on the benzene ring of the cinnamide. J Med Chem44:4393-403 (2001) Integrin alpha-L
Name:Integrin alpha-L
Type:PROTEIN
Mol. Mass.:128748.90
Organism:Homo sapiens (Human)
Description:ChEMBL_629045
Residue:1170
BDBM50107160
NameBDBM50107160
Synonyms:1-(4-Acetyl-piperazin-1-yl)-3-[4-(2,3-dihydro-benzo[1,4]dioxin-6-ylsulfanyl)-3-trifluoromethyl-phenyl]-propenone | CHEMBL138777
TypeSmall organic molecule
Emp. Form.C24H23F3N2O4S
Mol. Mass.492.511
SMILESCC(=O)N1CCN(CC1)C(=O)\C=C\c1ccc(Sc2ccc3OCCOc3c2)c(c1)C(F)(F)F