Reaction Details
TargetIntegrin alpha-L
LigandBDBM50107187
Substrate/Competitorn/a
Meas. Tech.ChEMBL_88939 (CHEMBL699111)
IC50 30±n/a nM
Citation Winn, MReilly, EBLiu, GHuth, JRJae, HSFreeman, JPei, ZXin, ZLynch, JKester, Jvon Geldern, TWLeitza, SDeVries, PDickinson, RMussatto, DOkasinski, GF Discovery of novel p-arylthio cinnamides as antagonists of leukocyte function-associated antigen-1/intercellular adhesion molecule-1 interaction. 4. Structure-activity relationship of substituents on the benzene ring of the cinnamide. J Med Chem44:4393-403 (2001) Integrin alpha-L
Name:Integrin alpha-L
Type:PROTEIN
Mol. Mass.:128748.90
Organism:Homo sapiens (Human)
Description:ChEMBL_629045
Residue:1170
BDBM50107187
NameBDBM50107187
Synonyms:3-[4-(2,3-Dihydro-benzo[1,4]dioxin-6-ylsulfanyl)-3-trifluoromethyl-phenyl]-1-morpholin-4-yl-propenone | CHEMBL136191
TypeSmall organic molecule
Emp. Form.C22H20F3NO4S
Mol. Mass.451.459
SMILESFC(F)(F)c1cc(\C=C\C(=O)N2CCOCC2)ccc1Sc1ccc2OCCOc2c1